Gch Error 1

COMO RESOLVER O ERRO: COULD NOT DOWNLOAD INTERNAL CONFIGS [GRAND CHASE HISTORY]

RECOMMENDED: If you have Windows errors then we strongly recommend that you download and run this (Windows) Repair Tool.

Nov 16, 2015  · Lost in Github FreeLSS install (Page 1). Makefile:28: recipe for target ‘Main.h.gch’ failed make: *** [Main.h.gch] Error 1. any help appreciated. Cheers.

GCH file: Precompiled C Header File. Read here what the GCH file is, and what application you need to open or convert it. Development.

Blue Screen Error Flash 6.Blue Screen Flashing – Paretologic PC Health Error Fix. ★★★ Blue Screen Flashing ★★ Fix, Clean, Repair # [ BLUE SCREEN FLASHING ] & Improve Its Performance! Do a come by on an ordinary basis, scan your PC to detect

Oct 20, 2015. C:UsersxxxxxDOCUME~1axoloti/build/xpatch.h.gch internal error in mingw32_gt_pch_use_address, at config/i386/host-mingw32.c:190:.

I used a makefile and for some reason it occasionally left a.h.gch file behind. Sometimes, this didn't affect the compilation, but every so often it would result in the compiler issuing an error for an issue.

.o shared/cube.h.gch.tmp shared/cube.h shared/cube.h:87:26: fatal error: SDL_opengles.h: No such file or directory compilation terminated. make: *** [shared/cube.h.gch] Error 1.

pch-source.h:43: /usr/include/ext2fs/bitops.h: In function `int ext2fs_find_first_bit_set(void*, unsigned int)’: /usr/include/ext2fs/bitops.h:440: error: invalid conversion from `unsigned char*’ to `char*’ make[1]: *** [pch.h.gch.

Error "The input line is too long. mingw32-make[1]: Entering directory. [tmp/ obj/debug_shared/WebKit_pch.h.gch/c++] Error 255 mingw32-make[2]: Leaving.

.[2]: *** [modules/core/precomp.hpp.gch/opencv_core_Release.gch] Error 1 CMakeFiles/Makefile2:862: fallo en las instrucciones para el objetivo.

Errors with Downloading OpenCV in Ubuntu -. – Errors with Downloading OpenCV in Ubuntu (Python). [modules/imgcodecs/precomp.hpp.gch/opencv_imgcodecs_RELEASE.gch] Error 1 CMakeFiles/Makefile2:5875:.

I am getting the following error in libstdc++ on i686-pc-cygwin. Owner/gcc/gcc/libstdc++-v3/include/precompiled/ stdc++.h -o i686-pc-cygwin/bits/stdc++.h.gch/O0g.gch /home/Owner/gcc/gcc/libstdc++.

My cmake output is here Now I try to build opencv and I have got this error : make [ 1. gch/opencv_core_Release.gch] Error 1. Error while building opencv.

Dec 27, 2013. If you don't need ffmpeg functionality, then it should be possible to build the remaining components of OpenCV-2.1.0 on Ubuntu 12.04 using.

Disclosure – q=%22Mini+web+server+1.0+ZTE%22+port%3A80+after%3 A01-12-2013 Many of these devices also expose the web_shell_cmd.gch script, making it available to unauthenticated users from the WAN side of the cable modem.

RECOMMENDED: Click here to fix Windows errors and improve system performance