Internal Error C1001

FLASH TUTORIAL | Error: Menu Cannot Be Displayed Due To Incompatible Flash | CANON Cameras

RECOMMENDED: If you have Windows errors then we strongly recommend that you download and run this (Windows) Repair Tool.

971672 Error message when you build a Visual C++ 2008 project that contains a specific struct type: "fatal error C1001: An internal error has occurred in the compiler" · 971676 Error message when you compile a Visual C++ 2008 project.

game-music-emugmefir_resampler.cpp(28): fatal error C1001: An internal error has occurred in the compiler. (compiler file ‘f:ddvctoolscompilerutcsrcp2main.c’, line 256) MSVC 19.10.25019.0 works fine while 19.11.25506.0 is broken

Describes a problem when you may receive an error message when template classes or template class header files are included in a precompiled header file.

Internal Compiler Error C1001 – Compiling the attached file does trigger an internal compiler error. Comiler: Visual Studio 2013 Version. C++ does not support default-int 1>e:andreassanboxvs_buginternal_errormain.cpp(11): fatal error C1001: An internal error has.

Jul 3, 2013. It was a stupid error but it was very taxing to check out all of these tough fixes. So I just. I would not have expected an internal compiler error.

error C1001: An internal error has occurred in the compiler. – One thing that smells a little funny: VC6 didn't have a mutex header. Did you add std::mutex stuff as part of your porting process? If not, it is possible.

This is because they are only supported on VS 2015 Update 1 and later. You need to:1) Load your solution into VS2015 Update 1 (or2).

Apr 26, 2017. c:worklibraries_localtensorflowtensorflowcorekernelsreduction_ops_gpu.cu. cc(64): fatal error C1001: An internal error has occurred in the.

You receive a "fatal error C1001: INTERNAL COMPILER ERROR. – Explains that you receive a "fatal error C1001: INTERNAL COMPILER ERROR" error message after you install a Visual Studio 6.0 service pack. You can remove.

Boost 1.60 with Visual 2013 results in a compiler error : boosttype_traits common_type.hpp(42): fatal error C1001: An internal error has occurred in the compiler.

Aug 16, 2011. I've encountered this error many times in VC++. Do the following steps. They've always helped me with this issue: Take a look at the exact.

This error is most often generated in one of two cases: Failure to recover the compiler's internal state following detection of a syntax error in the program. The.

This error is most often generated in one of two cases: Failure to recover the compiler’s internal state following detection of a syntax error in the program. The first pass of the compiler will occasionally fail when attempting to recover its state.

Foreign Exchange Rates & World Currencies – Bloomberg https://www.bloomberg.com/markets/currencies Current exchange rates of.

256(i8* %6, <8 x i32> %8, <8 x float> %9) 1>D:Rseti_boincclientwin_buildVS2015analyzeFuncs_avx.cpp : fatal error C1001: An internal error has occurred in the compiler. 1> %5 = call <4 x float> @llvm.x86.sse.max.ss(<4 x float>.

Search for stock, prices and datasheets for electronic parts by distributor and manufacturer.

fatal error C1001: An internal error has occurred in the compiler. When I pass only one parameter to "exec" function, everything is ok. But when I pass more then one parameters it issues an error. I use vs 2015 and visual c++ compiler.

Coaguchek Xs Pt Test Error 5 Offer point-of-care and PT/INR self-testing for greater confidence in patient. CoaguChek XS test strip is designed to provide lab-comparable accuracy. Accu-Chek® Inform II system Professional glucose testing for the wireless age Avoiding error 5 on Coaguchek XS – Sticky Blood-Hughes.

Hello, I am building an application, the application contains morethan 100 projects but it has problem only with one project. Regards. Suhas

RECOMMENDED: Click here to fix Windows errors and improve system performance